Ticket #1128 (closed defect: fixed)

Opened 11 years ago

Last modified 2 years ago

matchbox-keyboard-inputmethod fails on fic-gta01-font-size.patch

Reported by: cm@… Owned by: mickey@…
Priority: high Milestone:
Component: OE bitbake recipes / build system Version: current svn head
Severity: normal Keywords:
Cc: buglog@… Blocked By:
Blocking: Estimated Completion (week):
HasPatchForReview: PatchReviewResult:
Reproducible:

Description

After an update to OE by pfalcon the fic-gta01-font-size.patch no longer applies
to matchbox-keyboard-inputmethod_svn.bb:

cm@tyst> bitbake -c rebuild matchbox-keyboard-inputmethod /home/moko/build
NOTE: Psyco JIT Compiler (http://psyco.sf.net) not available. Install it to
increase performance.
NOTE: Handling BitBake? files: / (4926/4926) [100 %]
NOTE: Parsing finished. 4687 cached, 0 parsed, 239 skipped, 0 masked.
NOTE: build 200712130818: started

OE Build Configuration:
BB_VERSION = "1.8.8"
OE_REVISION = "9890d0d40875e213c32561b35341a282e157bd19"
TARGET_ARCH = "arm"
TARGET_OS = "linux-gnueabi"
MACHINE = "fic-gta01"
DISTRO = "openmoko"
DISTRO_VERSION = "P1-Snapshot-20071213"
TARGET_FPU = "soft"

NOTE: Resolving missing task queue dependencies
NOTE: preferred version 2.5 of glibc not available (for item
virtual/arm-angstrom-linux-gnueabi-libc-for-gcc)
NOTE: Preparing runqueue
NOTE: Executing runqueue
NOTE: Running task 1 of 1 (ID: 0,
/home/moko/openembedded/packages/matchbox-keyboard/matchbox-keyboard-inputmethod_svn.bb,
do_rebuild)
NOTE: package matchbox-keyboard-inputmethod-0.0+svnr1739: started
NOTE: package matchbox-keyboard-inputmethod-0.0+svnr1739-r9: task do_rebuild:
started
NOTE: package matchbox-keyboard-inputmethod-0.0+svnr1739-r9: task do_clean: started
NOTE: removing
/home/moko/build/tmp/work/armv4t-angstrom-linux-gnueabi/matchbox-keyboard-inputmethod-0.0+svnr1739-r9
NOTE: removing
/home/moko/build/tmp/stamps/armv4t-angstrom-linux-gnueabi/matchbox-keyboard-inputmethod-0.0+svnr1739-r9.*
NOTE: package matchbox-keyboard-inputmethod-0.0+svnr1739-r9: task do_clean:
completed
NOTE: package matchbox-keyboard-inputmethod-0.0+svnr1739-r9: task do_fetch: started
NOTE: package matchbox-keyboard-inputmethod-0.0+svnr1739-r9: task do_fetch:
completed
NOTE: package matchbox-keyboard-inputmethod-0.0+svnr1739-r9: task do_unpack: started
NOTE: Unpacking
/home/moko/sources/matchbox-keyboard_svn.o-hand.com_.repos.matchbox.trunk_1739_.tar.gz
to
/home/moko/build/tmp/work/armv4t-angstrom-linux-gnueabi/matchbox-keyboard-inputmethod-0.0+svnr1739-r9/
NOTE: Unpacking
/home/moko/openembedded/packages/matchbox-keyboard/files/80matchboxkeyboard to
/home/moko/build/tmp/work/armv4t-angstrom-linux-gnueabi/matchbox-keyboard-inputmethod-0.0+svnr1739-r9/
NOTE: package matchbox-keyboard-inputmethod-0.0+svnr1739-r9: task do_unpack:
completed
NOTE: package matchbox-keyboard-inputmethod-0.0+svnr1739-r9: task do_patch: started
NOTE: Applying patch 'smallscreen-fontsize.patch'
NOTE: Applying patch
'2-Add-new-modifier--layout--Used-to-cycle-thru-all-available-layouts.patch'
NOTE: Applying patch
'3-Changes-to-improve-layout-rendering--especially-after-adding-support-for.patch'
NOTE: Applying patch '4-Add-rendering-debug-logging.patch'
NOTE: Applying patch '5-Add-support-for-loading-multiple-independent-layouts.patch'
NOTE: Applying patch '6-Add-layout-switch-key-to-all-layouts.patch'
NOTE: Applying patch 'fic-gta01-font-size.patch'
ERROR: Error in executing:
ERROR: Exception:<class 'CmdError?'> Message:Command Error: exit status: 1 Output:
Applying patch fic-gta01-font-size.patch
patching file src/matchbox-keyboard.c
Hunk #1 FAILED at 52.
1 out of 1 hunk FAILED -- rejects in file src/matchbox-keyboard.c
Patch fic-gta01-font-size.patch does not apply (enforce with -f)
ERROR: Printing the environment of the function
ERROR: Error in executing:
ERROR: Exception:<class 'CmdError?'> Message:Command Error: exit status: 1 Output:
Applying patch fic-gta01-font-size.patch
patching file src/matchbox-keyboard.c
Hunk #1 FAILED at 52.
1 out of 1 hunk FAILED -- rejects in file src/matchbox-keyboard.c
Patch fic-gta01-font-size.patch does not apply (enforce with -f)
ERROR: Printing the environment of the function
ERROR: Error in executing:
ERROR: Exception:<class 'CmdError?'> Message:Command Error: exit status: 1 Output:
Applying patch fic-gta01-font-size.patch
patching file src/matchbox-keyboard.c
Hunk #1 FAILED at 52.
1 out of 1 hunk FAILED -- rejects in file src/matchbox-keyboard.c
Patch fic-gta01-font-size.patch does not apply (enforce with -f)
ERROR: Printing the environment of the function
ERROR: Error in executing:
ERROR: Exception:<class 'CmdError?'> Message:Command Error: exit status: 1 Output:
Applying patch fic-gta01-font-size.patch
patching file src/matchbox-keyboard.c
Hunk #1 FAILED at 52.
1 out of 1 hunk FAILED -- rejects in file src/matchbox-keyboard.c
Patch fic-gta01-font-size.patch does not apply (enforce with -f)
ERROR: Printing the environment of the function
ERROR: Error in executing:
ERROR: Exception:<class 'CmdError?'> Message:Command Error: exit status: 1 Output:
Applying patch fic-gta01-font-size.patch
patching file src/matchbox-keyboard.c
Hunk #1 FAILED at 52.
1 out of 1 hunk FAILED -- rejects in file src/matchbox-keyboard.c
Patch fic-gta01-font-size.patch does not apply (enforce with -f)
ERROR: Printing the environment of the function
ERROR: Build of
/home/moko/openembedded/packages/matchbox-keyboard/matchbox-keyboard-inputmethod_svn.bb
do_rebuild failed
Traceback (most recent call last):

File "/home/moko/bitbake/bin/bitbake", line 134, in <module>

main()

File "/home/moko/bitbake/bin/bitbake", line 131, in main

cooker.cook()

File "/home/moko/bitbake/lib/bb/cooker.py", line 552, in cook

return self.buildTargets(pkgs_to_build)

File "/home/moko/bitbake/lib/bb/cooker.py", line 466, in buildTargets

failures = rq.execute_runqueue()

File "/home/moko/bitbake/lib/bb/runqueue.py", line 403, in execute_runqueue

self.execute_runqueue_internal()

File "/home/moko/bitbake/lib/bb/runqueue.py", line 531, in

execute_runqueue_internal

self.cooker.tryBuild(fn, False)

File "/home/moko/bitbake/lib/bb/cooker.py", line 125, in tryBuild

return self.tryBuildPackage(fn, item, self.configuration.cmd, the_data,

build_depends)

File "/home/moko/bitbake/lib/bb/cooker.py", line 98, in tryBuildPackage

bb.build.exec_task('do_%s' % task, the_data)

File "/home/moko/bitbake/lib/bb/build.py", line 292, in exec_task

execute(None, task)

File "/home/moko/bitbake/lib/bb/build.py", line 281, in execute

exec_func(item, localdata)

File "/home/moko/bitbake/lib/bb/build.py", line 98, in exec_func

exec_func_python(func, d)

File "/home/moko/bitbake/lib/bb/build.py", line 117, in exec_func_python

utils.better_exec(comp,g,tmp, bb.data.getVar('FILE',d,1))

File "/home/moko/bitbake/lib/bb/utils.py", line 144, in better_exec

exec code in context

File "do_rebuild", line 4, in <module>
File "do_rebuild", line 2, in do_rebuild
File "/home/moko/bitbake/lib/bb/build.py", line 98, in exec_func

exec_func_python(func, d)

File "/home/moko/bitbake/lib/bb/build.py", line 117, in exec_func_python

utils.better_exec(comp,g,tmp, bb.data.getVar('FILE',d,1))

File "/home/moko/bitbake/lib/bb/utils.py", line 144, in better_exec

exec code in context

File "base_do_rebuild", line 6, in <module>
File "base_do_rebuild", line 4, in base_do_rebuild
File "/home/moko/bitbake/lib/bb/build.py", line 294, in exec_task

task_graph.walkdown(task, execute)

File "/home/moko/bitbake/lib/bb/init.py", line 1215, in walkdown

ret = self.walkdown(p, callback, debug, usecache)

File "/home/moko/bitbake/lib/bb/init.py", line 1215, in walkdown

ret = self.walkdown(p, callback, debug, usecache)

File "/home/moko/bitbake/lib/bb/init.py", line 1215, in walkdown

ret = self.walkdown(p, callback, debug, usecache)

File "/home/moko/bitbake/lib/bb/init.py", line 1215, in walkdown

ret = self.walkdown(p, callback, debug, usecache)

File "/home/moko/bitbake/lib/bb/init.py", line 1215, in walkdown

ret = self.walkdown(p, callback, debug, usecache)

File "/home/moko/bitbake/lib/bb/init.py", line 1215, in walkdown

ret = self.walkdown(p, callback, debug, usecache)

File "/home/moko/bitbake/lib/bb/init.py", line 1215, in walkdown

ret = self.walkdown(p, callback, debug, usecache)

File "/home/moko/bitbake/lib/bb/init.py", line 1220, in walkdown

return callback(self, item)

File "/home/moko/bitbake/lib/bb/build.py", line 271, in execute

exec_task(item, d)

File "/home/moko/bitbake/lib/bb/build.py", line 294, in exec_task

task_graph.walkdown(task, execute)

File "/home/moko/bitbake/lib/bb/init.py", line 1220, in walkdown

return callback(self, item)

File "/home/moko/bitbake/lib/bb/build.py", line 281, in execute

exec_func(item, localdata)

File "/home/moko/bitbake/lib/bb/build.py", line 98, in exec_func

exec_func_python(func, d)

File "/home/moko/bitbake/lib/bb/build.py", line 117, in exec_func_python

utils.better_exec(comp,g,tmp, bb.data.getVar('FILE',d,1))

File "/home/moko/bitbake/lib/bb/utils.py", line 144, in better_exec

exec code in context

File "do_patch", line 4, in <module>
File "do_patch", line 2, in do_patch
File "/home/moko/bitbake/lib/bb/build.py", line 98, in exec_func

exec_func_python(func, d)

File "/home/moko/bitbake/lib/bb/build.py", line 117, in exec_func_python

utils.better_exec(comp,g,tmp, bb.data.getVar('FILE',d,1))

File "/home/moko/bitbake/lib/bb/utils.py", line 144, in better_exec

exec code in context

File "base_do_patch", line 4, in <module>
File "base_do_patch", line 2, in base_do_patch
File "/home/moko/bitbake/lib/bb/build.py", line 98, in exec_func

exec_func_python(func, d)

File "/home/moko/bitbake/lib/bb/build.py", line 117, in exec_func_python

utils.better_exec(comp,g,tmp, bb.data.getVar('FILE',d,1))

File "/home/moko/bitbake/lib/bb/utils.py", line 144, in better_exec

exec code in context

File "patch_do_patch", line 100, in <module>
File "patch_do_patch", line 98, in patch_do_patch
File "<bb>", line 339, in Resolve

builtin.CmdError?: Command Error: exit status: 1 Output:
Applying patch fic-gta01-font-size.patch
patching file src/matchbox-keyboard.c
Hunk #1 FAILED at 52.
1 out of 1 hunk FAILED -- rejects in file src/matchbox-keyboard.c
Patch fic-gta01-font-size.patch does not apply (enforce with -f)
ERROR: Task 0
(/home/moko/openembedded/packages/matchbox-keyboard/matchbox-keyboard-inputmethod_svn.bb,
do_rebuild) failed
NOTE: Tasks Summary: Attempted 0 tasks of which 0 didn't need to be rerun and 1
failed.
ERROR:
'/home/moko/openembedded/packages/matchbox-keyboard/matchbox-keyboard-inputmethod_svn.bb'
failed

Attachments

fic-gta01-font-size.patch (489 bytes) - added by mail@… 11 years ago.
Modified patch

Change History

Changed 11 years ago by mail@…

Modified patch

comment:1 Changed 11 years ago by john_lee@…

  • Status changed from new to closed
  • Resolution set to fixed

I think this problem is gone in the latest OE.

comment:2 Changed 2 years ago by RoberMync

Propecia Package Insert <a href=http://cial1.xyz/buy-cialis-online-cheap.php>Buy Cialis Online Cheap</a> Cialis Generico 5 Mg Prezzo Forumfree Levitra <a href=http://viag1.xyz/viagra-online.php>Viagra Online</a> Buy Lasix Online Usa Forum Viagra Sans Ordonnance <a href=http://viag1.xyz/how-much-is-viagra.php>How Much Is Viagra</a> Viagra Samples Free Kamagra Sildenafil 100mg Tablets <a href=http://cial5mg.xyz/mail-order-cialis.php>Mail Order Cialis</a> When Amoxicillin Takes Effect Amoxicillin And Gout <a href=http://cial5mg.xyz/cialis-generic.php>Cialis Generic</a> Womens Tadalis Sx Soft Zithromax Seizure Threshold <a href=http://viag1.xyz/cheap-viagra-sales.php>Cheap Viagra Sales</a> Propecia Y Etanol Viagra Combo Packs <a href=http://zol1.xyz/order-generic-zoloft.php>Order Generic Zoloft</a> Mail Order Free Shipping Provera Medroxine Direct In Internet Keflex 250 Mg <a href=http://cial1.xyz/cialis-free-trial.php>Cialis Free Trial</a> Propecia Package Insert Purchase Dutasteride Website <a href=http://kama1.xyz/purchase-kamagra-usa.php>Purchase Kamagra Usa</a> Prix Cialis Generique Pharmacie Cost Of Priligy <a href=http://zol1.xyz/where-to-buy-zoloft.php>Where To Buy Zoloft</a> Vende Viagra Clomid Homme Fait <a href=http://zol1.xyz/zoloft-free-offer.php>Zoloft Free Offer</a> Kamagra Problems Canada Meds Online Pharmacy <a href=http://cial1.xyz/tadalafil-generic.php>Tadalafil Generic</a> Viagra C'Est Quoi Xenical Diet Pill Online From Canada <a href=http://cial5mg.xyz/cialis-buy.php>Cialis Buy</a> Priligy Approuve Par La Fda Cialis Viagra Levitra Comprar <a href=http://cial1.xyz/cialis-usa.php>Cialis Usa</a> Levitra Puede Fallar Dove Comprare Il Cialis On Line <a href=http://cial1.xyz/brand-cialis.php>Brand Cialis</a> Acheter Du Dermipred En Ligne Cialis Buy Brand <a href=http://kama1.xyz/kamagra-cheap.php>Kamagra Cheap</a> Hydrochlorothiazide Online Bestellen Comprar Cialis En Farmacia <a href=http://kama1.xyz/generic-kamagra-pills.php>Generic Kamagra Pills</a> Priligy Cream Comprar Viagra Sin Receta Medica <a href=http://cialis.ccrpdc.com/ordina-cialis-online.php>Ordina Cialis Online</a> Viagra Dosierung Cialis Buy Viagra Online Canadian Health <a href=http://viag1.xyz/best-generic-viagra.php>Best Generic Viagra</a> Propecia While Nursing Cialis 10mg Rezeptfrei Bestellen <a href=http://zol1.xyz/purchase-cheap-zoloft.php>Purchase Cheap Zoloft</a> Is It Safe To Buy Levitra On Line Fish Medicine Amoxicillin <a href=http://viag1.xyz/sildenafil-100mg.php>Sildenafil 100mg</a> Zithromax Aman Untuk Ibu Hamil Buy Valtrexin Usa <a href=http://viag1.xyz/viagra-online-online.php>Viagra Online Online</a> Penecillin And Amoxicillin Are For Sale Secure Online Progesterone Real Next Day <a href=http://kama1.xyz/buy-kamagra-online-100mg.php>Buy Kamagra Online 100mg</a> Clomid Et Duphaston 2008

Note: See TracTickets for help on using tickets.